{"text_format":"1","workbook":"xlsx","n_sheets":3,"sheets":["Rate Pages","Plan Design Summary","Rates by County"],"not_rendered":{"charts":0,"images":0,"macros":1,"external_links":0,"defined_names":3,"comments":0,"pivot_tables":0},"unopened":[],"bounds":{"document_bytes":16777216,"sheet_cells":100000,"rows_first":2000,"rows_last":500,"rows_between":2000,"halvings":0,"cell_chars":16384,"cell_head_chars":4096},"cells_cut":0,"cells_raw":0,"read":"whole","date_system":"1900"}

{"sheet":"Rate Pages","index":0,"n_rows":69,"n_cols":12,"rows_kept":69,"cut":false,"hidden":false,"merged":[[16,8,16,9],[8,8,8,9],[9,8,9,9],[15,4,15,5],[6,6,6,7],[10,6,10,7],[11,6,11,7],[12,6,12,7],[13,6,13,7],[14,6,14,7],[15,6,15,7],[6,8,6,9],[15,8,15,9],[7,8,7,9],[12,8,12,9],[13,8,13,9],[16,2,16,3],[7,2,7,3],[5,2,5,3],[5,4,5,5],[5,6,5,7],[10,2,10,3],[11,2,11,3],[9,2,9,3],[6,2,6,3],[14,2,14,3],[12,2,12,3],[13,2,13,3],[15,2,15,3],[8,2,8,3],[8,6,8,7],[8,4,8,5],[14,8,14,9],[11,8,11,9],[11,4,11,5],[10,8,10,9],[10,4,10,5],[9,6,9,7],[9,4,9,5],[16,6,16,7],[16,4,16,5],[14,4,14,5],[13,4,13,5],[12,4,12,5],[7,6,7,7],[7,4,7,5],[6,4,6,5],[5,8,5,9],[3,8,3,9],[12,10,12,11],[13,10,13,11],[14,10,14,11],[15,10,15,11],[16,10,16,11],[7,10,7,11],[8,10,8,11],[9,10,9,11],[10,10,10,11],[11,10,11,11],[0,2,0,3],[1,2,1,3],[2,2,2,3],[5,10,5,11],[6,10,6,11],[3,2,3,3]]}
[null,"Company Name:"]
[null,"Market:","Individual"]
[null,"Product:"]
[null,"Effective Date of Rates:","2019-01-01",null,null,null,"Ending date of Rates:",null,"2019-12-31"]
[]
[null,"HIOS Plan ID (On Exchange)=>"]
[null,"HIOS Plan ID (Off Exchange)=>"]
[null,"Plan Marketing Name =>"]
[null,"Form # =>"]
[null,"Rating Area =>"]
[null,"Network =>"]
[null,"Metal =>"]
[null,"Deductible =>"]
[null,"Coinsurance =>"]
[null,"Copays =>"]
[null,"OOP Maximum =>"]
[null,"Pediatric Dental (Yes/No) =>"]
[null,"Age Band","Non-Tobacco","Tobacco","Non-Tobacco","Tobacco","Non-Tobacco","Tobacco","Non-Tobacco","Tobacco","Non-Tobacco","Tobacco"]
[null,"0 - 14"]
[null,15]
[null,16]
[null,17]
[null,18]
[null,19]
[null,20]
[null,21]
[null,22]
[null,23]
[null,24]
[null,25]
[null,26]
[null,27]
[null,28]
[null,29]
[null,30]
[null,31]
[null,32]
[null,33]
[null,34]
[null,35]
{"$rows_left_out":30}
{"sheet":"Plan Design Summary","index":1,"n_rows":6,"n_cols":9,"rows_kept":6,"cut":false,"hidden":false,"merged":[[0,1,0,8],[1,1,1,8],[2,1,2,8]]}
[null,{"$f":"'Rate Pages'!C1","v":0}]
[null,{"$f":"'Rate Pages'!C2","v":"Individual"}]
[null,"Plan Design Summary"]
[]
[]
[null,"HIOS Plan ID","Plan Marketing Name","Product","Metal","On/Off Exchange","Network","Rating Area","Counties Covered"]

{"sheet":"Rates by County","index":2,"n_rows":256,"n_cols":82,"rows_kept":256,"cut":false,"hidden":false,"merged":[[4,2,4,5]]}
[null,"Company Name",{"$f":"'Rate Pages'!C1","v":0}]
[null,"Market",{"$f":"'Rate Pages'!C2","v":"Individual"}]
[null,"RATES FOR AGE 21, NON-TOBACCO USER, BY RATING AREA AND COUNTY"]
[null,null,null,null,null,null,null,"RATING AREA 1",null,null,null,null,null,null,null,null,"RATING AREA 2",null,null,null,"RATING AREA 3",null,null,null,null,null,null,null,null,null,null,null,null,null,"RATING AREA 4",null,null,null,null,null,null,null,null,null,null,"RATING AREA 5",null,null,null,null,null,null,null,"RATING AREA 6",null,null,null,null,null,null,null,null,null,null,"RATING AREA 7",null,null,null,null,"RATING AREA 8",null,null,null,null,null,"RATING AREA 9"]
[null,null,{"$f":"TEXT(EDATE('Rate Pages'!$C$4,-11),\"MM-DD-YYYY\")&\" Number of Covered Lives by Rating County\"","v":"02-01-2018 Number of Covered Lives by Rating County"},null,null,null,null,0,0,0,0,0,0,0,0,null,0,0,0,null,0,0,0,0,0,0,0,0,0,0,0,0,0,null,0,0,0,0,0,0,0,0,0,0,null,0,0,0,0,0,0,0,null,0,0,0,0,0,0,0,0,0,0,null,0,0,0,0,null,0,0,0,0,0,null,0,0,0,0,0,0,0]
[null,"HIOS Plan ID","Plan Marketing Name","Product","Metal","On/Off Exchange",null,"Crawford","Clarion","Erie","Forest","Mckean","Mercer","Venango","Warren",null,"Elk","Cameron","Potter",null,"Bradford","Carbon","Clinton","Lackawanna","Luzerne","Lycoming","Monroe","Pike","Sullivan","Susquehanna","Tioga","Wayne","Wyoming",null,"Allegheny","Armstrong","Beaver","Butler","Fayette","Greene","Indiana","Lawrence","Washington","Westmoreland",null,"Bedford","Blair","Clearfield","Cambria","Huntingdon","Jefferson","Somerset",null,"Centre","Columbia","Lehigh","Mifflin","Montour","Northampton","Northumberland","Schuylkill","Snyder","Union",null,"Adams","Berks","Lancaster","York",null,"Bucks","Chester","Delaware","Montgomery","Philadelphia",null,"Cumberland","Dauphin","Franklin","Fulton","Juniata","Lebanon","Perry"]
[null,{"$f":"IF('Plan Design Summary'!B7=\"\",\"\",'Plan Design Summary'!B7)","v":""},{"$f":"IF('Plan Design Summary'!C7=\"\",\"\",'Plan Design Summary'!C7)","v":""},{"$f":"IF('Plan Design Summary'!D7=\"\",\"\",'Plan Design Summary'!D7)","v":""},{"$f":"IF('Plan Design Summary'!E7=\"\",\"\",'Plan Design Summary'!E7)","v":""},{"$f":"IF('Plan Design Summary'!F7=\"\",\"\",'Plan Design Summary'!F7)","v":""}]
[null,{"$f":"IF('Plan Design Summary'!B8=\"\",\"\",'Plan Design Summary'!B8)","v":""},{"$f":"IF('Plan Design Summary'!C8=\"\",\"\",'Plan Design Summary'!C8)","v":""},{"$f":"IF('Plan Design Summary'!D8=\"\",\"\",'Plan Design Summary'!D8)","v":""},{"$f":"IF('Plan Design Summary'!E8=\"\",\"\",'Plan Design Summary'!E8)","v":""},{"$f":"IF('Plan Design Summary'!F8=\"\",\"\",'Plan Design Summary'!F8)","v":""}]
[null,{"$f":"IF('Plan Design Summary'!B9=\"\",\"\",'Plan Design Summary'!B9)","v":""},{"$f":"IF('Plan Design Summary'!C9=\"\",\"\",'Plan Design Summary'!C9)","v":""},{"$f":"IF('Plan Design Summary'!D9=\"\",\"\",'Plan Design Summary'!D9)","v":""},{"$f":"IF('Plan Design Summary'!E9=\"\",\"\",'Plan Design Summary'!E9)","v":""},{"$f":"IF('Plan Design Summary'!F9=\"\",\"\",'Plan Design Summary'!F9)","v":""}]
[null,{"$f":"IF('Plan Design Summary'!B10=\"\",\"\",'Plan Design Summary'!B10)","v":""},{"$f":"IF('Plan Design Summary'!C10=\"\",\"\",'Plan Design Summary'!C10)","v":""},{"$f":"IF('Plan Design Summary'!D10=\"\",\"\",'Plan Design Summary'!D10)","v":""},{"$f":"IF('Plan Design Summary'!E10=\"\",\"\",'Plan Design Summary'!E10)","v":""},{"$f":"IF('Plan Design Summary'!F10=\"\",\"\",'Plan Design Summary'!F10)","v":""}]
[null,{"$f":"IF('Plan Design Summary'!B11=\"\",\"\",'Plan Design Summary'!B11)","v":""},{"$f":"IF('Plan Design Summary'!C11=\"\",\"\",'Plan Design Summary'!C11)","v":""},{"$f":"IF('Plan Design Summary'!D11=\"\",\"\",'Plan Design Summary'!D11)","v":""},{"$f":"IF('Plan Design Summary'!E11=\"\",\"\",'Plan Design Summary'!E11)","v":""},{"$f":"IF('Plan Design Summary'!F11=\"\",\"\",'Plan Design Summary'!F11)","v":""}]
[null,{"$f":"IF('Plan Design Summary'!B12=\"\",\"\",'Plan Design Summary'!B12)","v":""},{"$f":"IF('Plan Design Summary'!C12=\"\",\"\",'Plan Design Summary'!C12)","v":""},{"$f":"IF('Plan Design Summary'!D12=\"\",\"\",'Plan Design Summary'!D12)","v":""},{"$f":"IF('Plan Design Summary'!E12=\"\",\"\",'Plan Design Summary'!E12)","v":""},{"$f":"IF('Plan Design Summary'!F12=\"\",\"\",'Plan Design Summary'!F12)","v":""}]
[null,{"$f":"IF('Plan Design Summary'!B13=\"\",\"\",'Plan Design Summary'!B13)","v":""},{"$f":"IF('Plan Design Summary'!C13=\"\",\"\",'Plan Design Summary'!C13)","v":""},{"$f":"IF('Plan Design Summary'!D13=\"\",\"\",'Plan Design Summary'!D13)","v":""},{"$f":"IF('Plan Design Summary'!E13=\"\",\"\",'Plan Design Summary'!E13)","v":""},{"$f":"IF('Plan Design Summary'!F13=\"\",\"\",'Plan Design Summary'!F13)","v":""}]
[null,{"$f":"IF('Plan Design Summary'!B14=\"\",\"\",'Plan Design Summary'!B14)","v":""},{"$f":"IF('Plan Design Summary'!C14=\"\",\"\",'Plan Design Summary'!C14)","v":""},{"$f":"IF('Plan Design Summary'!D14=\"\",\"\",'Plan Design Summary'!D14)","v":""},{"$f":"IF('Plan Design Summary'!E14=\"\",\"\",'Plan Design Summary'!E14)","v":""},{"$f":"IF('Plan Design Summary'!F14=\"\",\"\",'Plan Design Summary'!F14)","v":""}]
[null,{"$f":"IF('Plan Design Summary'!B15=\"\",\"\",'Plan Design Summary'!B15)","v":""},{"$f":"IF('Plan Design Summary'!C15=\"\",\"\",'Plan Design Summary'!C15)","v":""},{"$f":"IF('Plan Design Summary'!D15=\"\",\"\",'Plan Design Summary'!D15)","v":""},{"$f":"IF('Plan Design Summary'!E15=\"\",\"\",'Plan Design Summary'!E15)","v":""},{"$f":"IF('Plan Design Summary'!F15=\"\",\"\",'Plan Design Summary'!F15)","v":""}]
[null,{"$f":"IF('Plan Design Summary'!B16=\"\",\"\",'Plan Design Summary'!B16)","v":""},{"$f":"IF('Plan Design Summary'!C16=\"\",\"\",'Plan Design Summary'!C16)","v":""},{"$f":"IF('Plan Design Summary'!D16=\"\",\"\",'Plan Design Summary'!D16)","v":""},{"$f":"IF('Plan Design Summary'!E16=\"\",\"\",'Plan Design Summary'!E16)","v":""},{"$f":"IF('Plan Design Summary'!F16=\"\",\"\",'Plan Design Summary'!F16)","v":""}]
[null,{"$f":"IF('Plan Design Summary'!B17=\"\",\"\",'Plan Design Summary'!B17)","v":""},{"$f":"IF('Plan Design Summary'!C17=\"\",\"\",'Plan Design Summary'!C17)","v":""},{"$f":"IF('Plan Design Summary'!D17=\"\",\"\",'Plan Design Summary'!D17)","v":""},{"$f":"IF('Plan Design Summary'!E17=\"\",\"\",'Plan Design Summary'!E17)","v":""},{"$f":"IF('Plan Design Summary'!F17=\"\",\"\",'Plan Design Summary'!F17)","v":""}]
[null,{"$f":"IF('Plan Design Summary'!B18=\"\",\"\",'Plan Design Summary'!B18)","v":""},{"$f":"IF('Plan Design Summary'!C18=\"\",\"\",'Plan Design Summary'!C18)","v":""},{"$f":"IF('Plan Design Summary'!D18=\"\",\"\",'Plan Design Summary'!D18)","v":""},{"$f":"IF('Plan Design Summary'!E18=\"\",\"\",'Plan Design Summary'!E18)","v":""},{"$f":"IF('Plan Design Summary'!F18=\"\",\"\",'Plan Design Summary'!F18)","v":""}]
[null,{"$f":"IF('Plan Design Summary'!B19=\"\",\"\",'Plan Design Summary'!B19)","v":""},{"$f":"IF('Plan Design Summary'!C19=\"\",\"\",'Plan Design Summary'!C19)","v":""},{"$f":"IF('Plan Design Summary'!D19=\"\",\"\",'Plan Design Summary'!D19)","v":""},{"$f":"IF('Plan Design Summary'!E19=\"\",\"\",'Plan Design Summary'!E19)","v":""},{"$f":"IF('Plan Design Summary'!F19=\"\",\"\",'Plan Design Summary'!F19)","v":""}]
[null,{"$f":"IF('Plan Design Summary'!B20=\"\",\"\",'Plan Design Summary'!B20)","v":""},{"$f":"IF('Plan Design Summary'!C20=\"\",\"\",'Plan Design Summary'!C20)","v":""},{"$f":"IF('Plan Design Summary'!D20=\"\",\"\",'Plan Design Summary'!D20)","v":""},{"$f":"IF('Plan Design Summary'!E20=\"\",\"\",'Plan Design Summary'!E20)","v":""},{"$f":"IF('Plan Design Summary'!F20=\"\",\"\",'Plan Design Summary'!F20)","v":""}]
[null,{"$f":"IF('Plan Design Summary'!B21=\"\",\"\",'Plan Design Summary'!B21)","v":""},{"$f":"IF('Plan Design Summary'!C21=\"\",\"\",'Plan Design Summary'!C21)","v":""},{"$f":"IF('Plan Design Summary'!D21=\"\",\"\",'Plan Design Summary'!D21)","v":""},{"$f":"IF('Plan Design Summary'!E21=\"\",\"\",'Plan Design Summary'!E21)","v":""},{"$f":"IF('Plan Design Summary'!F21=\"\",\"\",'Plan Design Summary'!F21)","v":""}]
[null,{"$f":"IF('Plan Design Summary'!B22=\"\",\"\",'Plan Design Summary'!B22)","v":""},{"$f":"IF('Plan Design Summary'!C22=\"\",\"\",'Plan Design Summary'!C22)","v":""},{"$f":"IF('Plan Design Summary'!D22=\"\",\"\",'Plan Design Summary'!D22)","v":""},{"$f":"IF('Plan Design Summary'!E22=\"\",\"\",'Plan Design Summary'!E22)","v":""},{"$f":"IF('Plan Design Summary'!F22=\"\",\"\",'Plan Design Summary'!F22)","v":""}]
[null,{"$f":"IF('Plan Design Summary'!B23=\"\",\"\",'Plan Design Summary'!B23)","v":""},{"$f":"IF('Plan Design Summary'!C23=\"\",\"\",'Plan Design Summary'!C23)","v":""},{"$f":"IF('Plan Design Summary'!D23=\"\",\"\",'Plan Design Summary'!D23)","v":""},{"$f":"IF('Plan Design Summary'!E23=\"\",\"\",'Plan Design Summary'!E23)","v":""},{"$f":"IF('Plan Design Summary'!F23=\"\",\"\",'Plan Design Summary'!F23)","v":""}]
[null,{"$f":"IF('Plan Design Summary'!B24=\"\",\"\",'Plan Design Summary'!B24)","v":""},{"$f":"IF('Plan Design Summary'!C24=\"\",\"\",'Plan Design Summary'!C24)","v":""},{"$f":"IF('Plan Design Summary'!D24=\"\",\"\",'Plan Design Summary'!D24)","v":""},{"$f":"IF('Plan Design Summary'!E24=\"\",\"\",'Plan Design Summary'!E24)","v":""},{"$f":"IF('Plan Design Summary'!F24=\"\",\"\",'Plan Design Summary'!F24)","v":""}]
[null,{"$f":"IF('Plan Design Summary'!B25=\"\",\"\",'Plan Design Summary'!B25)","v":""},{"$f":"IF('Plan Design Summary'!C25=\"\",\"\",'Plan Design Summary'!C25)","v":""},{"$f":"IF('Plan Design Summary'!D25=\"\",\"\",'Plan Design Summary'!D25)","v":""},{"$f":"IF('Plan Design Summary'!E25=\"\",\"\",'Plan Design Summary'!E25)","v":""},{"$f":"IF('Plan Design Summary'!F25=\"\",\"\",'Plan Design Summary'!F25)","v":""}]
[null,{"$f":"IF('Plan Design Summary'!B26=\"\",\"\",'Plan Design Summary'!B26)","v":""},{"$f":"IF('Plan Design Summary'!C26=\"\",\"\",'Plan Design Summary'!C26)","v":""},{"$f":"IF('Plan Design Summary'!D26=\"\",\"\",'Plan Design Summary'!D26)","v":""},{"$f":"IF('Plan Design Summary'!E26=\"\",\"\",'Plan Design Summary'!E26)","v":""},{"$f":"IF('Plan Design Summary'!F26=\"\",\"\",'Plan Design Summary'!F26)","v":""}]
[null,{"$f":"IF('Plan Design Summary'!B27=\"\",\"\",'Plan Design Summary'!B27)","v":""},{"$f":"IF('Plan Design Summary'!C27=\"\",\"\",'Plan Design Summary'!C27)","v":""},{"$f":"IF('Plan Design Summary'!D27=\"\",\"\",'Plan Design Summary'!D27)","v":""},{"$f":"IF('Plan Design Summary'!E27=\"\",\"\",'Plan Design Summary'!E27)","v":""},{"$f":"IF('Plan Design Summary'!F27=\"\",\"\",'Plan Design Summary'!F27)","v":""}]
[null,{"$f":"IF('Plan Design Summary'!B28=\"\",\"\",'Plan Design Summary'!B28)","v":""},{"$f":"IF('Plan Design Summary'!C28=\"\",\"\",'Plan Design Summary'!C28)","v":""},{"$f":"IF('Plan Design Summary'!D28=\"\",\"\",'Plan Design Summary'!D28)","v":""},{"$f":"IF('Plan Design Summary'!E28=\"\",\"\",'Plan Design Summary'!E28)","v":""},{"$f":"IF('Plan Design Summary'!F28=\"\",\"\",'Plan Design Summary'!F28)","v":""}]
[null,{"$f":"IF('Plan Design Summary'!B29=\"\",\"\",'Plan Design Summary'!B29)","v":""},{"$f":"IF('Plan Design Summary'!C29=\"\",\"\",'Plan Design Summary'!C29)","v":""},{"$f":"IF('Plan Design Summary'!D29=\"\",\"\",'Plan Design Summary'!D29)","v":""},{"$f":"IF('Plan Design Summary'!E29=\"\",\"\",'Plan Design Summary'!E29)","v":""},{"$f":"IF('Plan Design Summary'!F29=\"\",\"\",'Plan Design Summary'!F29)","v":""}]
[null,{"$f":"IF('Plan Design Summary'!B30=\"\",\"\",'Plan Design Summary'!B30)","v":""},{"$f":"IF('Plan Design Summary'!C30=\"\",\"\",'Plan Design Summary'!C30)","v":""},{"$f":"IF('Plan Design Summary'!D30=\"\",\"\",'Plan Design Summary'!D30)","v":""},{"$f":"IF('Plan Design Summary'!E30=\"\",\"\",'Plan Design Summary'!E30)","v":""},{"$f":"IF('Plan Design Summary'!F30=\"\",\"\",'Plan Design Summary'!F30)","v":""}]
[null,{"$f":"IF('Plan Design Summary'!B31=\"\",\"\",'Plan Design Summary'!B31)","v":""},{"$f":"IF('Plan Design Summary'!C31=\"\",\"\",'Plan Design Summary'!C31)","v":""},{"$f":"IF('Plan Design Summary'!D31=\"\",\"\",'Plan Design Summary'!D31)","v":""},{"$f":"IF('Plan Design Summary'!E31=\"\",\"\",'Plan Design Summary'!E31)","v":""},{"$f":"IF('Plan Design Summary'!F31=\"\",\"\",'Plan Design Summary'!F31)","v":""}]
[null,{"$f":"IF('Plan Design Summary'!B32=\"\",\"\",'Plan Design Summary'!B32)","v":""},{"$f":"IF('Plan Design Summary'!C32=\"\",\"\",'Plan Design Summary'!C32)","v":""},{"$f":"IF('Plan Design Summary'!D32=\"\",\"\",'Plan Design Summary'!D32)","v":""},{"$f":"IF('Plan Design Summary'!E32=\"\",\"\",'Plan Design Summary'!E32)","v":""},{"$f":"IF('Plan Design Summary'!F32=\"\",\"\",'Plan Design Summary'!F32)","v":""}]
[null,{"$f":"IF('Plan Design Summary'!B33=\"\",\"\",'Plan Design Summary'!B33)","v":""},{"$f":"IF('Plan Design Summary'!C33=\"\",\"\",'Plan Design Summary'!C33)","v":""},{"$f":"IF('Plan Design Summary'!D33=\"\",\"\",'Plan Design Summary'!D33)","v":""},{"$f":"IF('Plan Design Summary'!E33=\"\",\"\",'Plan Design Summary'!E33)","v":""},{"$f":"IF('Plan Design Summary'!F33=\"\",\"\",'Plan Design Summary'!F33)","v":""}]
[null,{"$f":"IF('Plan Design Summary'!B34=\"\",\"\",'Plan Design Summary'!B34)","v":""},{"$f":"IF('Plan Design Summary'!C34=\"\",\"\",'Plan Design Summary'!C34)","v":""},{"$f":"IF('Plan Design Summary'!D34=\"\",\"\",'Plan Design Summary'!D34)","v":""},{"$f":"IF('Plan Design Summary'!E34=\"\",\"\",'Plan Design Summary'!E34)","v":""},{"$f":"IF('Plan Design Summary'!F34=\"\",\"\",'Plan Design Summary'!F34)","v":""}]
[null,{"$f":"IF('Plan Design Summary'!B35=\"\",\"\",'Plan Design Summary'!B35)","v":""},{"$f":"IF('Plan Design Summary'!C35=\"\",\"\",'Plan Design Summary'!C35)","v":""},{"$f":"IF('Plan Design Summary'!D35=\"\",\"\",'Plan Design Summary'!D35)","v":""},{"$f":"IF('Plan Design Summary'!E35=\"\",\"\",'Plan Design Summary'!E35)","v":""},{"$f":"IF('Plan Design Summary'!F35=\"\",\"\",'Plan Design Summary'!F35)","v":""}]
[null,{"$f":"IF('Plan Design Summary'!B36=\"\",\"\",'Plan Design Summary'!B36)","v":""},{"$f":"IF('Plan Design Summary'!C36=\"\",\"\",'Plan Design Summary'!C36)","v":""},{"$f":"IF('Plan Design Summary'!D36=\"\",\"\",'Plan Design Summary'!D36)","v":""},{"$f":"IF('Plan Design Summary'!E36=\"\",\"\",'Plan Design Summary'!E36)","v":""},{"$f":"IF('Plan Design Summary'!F36=\"\",\"\",'Plan Design Summary'!F36)","v":""}]
[null,{"$f":"IF('Plan Design Summary'!B37=\"\",\"\",'Plan Design Summary'!B37)","v":""},{"$f":"IF('Plan Design Summary'!C37=\"\",\"\",'Plan Design Summary'!C37)","v":""},{"$f":"IF('Plan Design Summary'!D37=\"\",\"\",'Plan Design Summary'!D37)","v":""},{"$f":"IF('Plan Design Summary'!E37=\"\",\"\",'Plan Design Summary'!E37)","v":""},{"$f":"IF('Plan Design Summary'!F37=\"\",\"\",'Plan Design Summary'!F37)","v":""}]
[null,{"$f":"IF('Plan Design Summary'!B38=\"\",\"\",'Plan Design Summary'!B38)","v":""},{"$f":"IF('Plan Design Summary'!C38=\"\",\"\",'Plan Design Summary'!C38)","v":""},{"$f":"IF('Plan Design Summary'!D38=\"\",\"\",'Plan Design Summary'!D38)","v":""},{"$f":"IF('Plan Design Summary'!E38=\"\",\"\",'Plan Design Summary'!E38)","v":""},{"$f":"IF('Plan Design Summary'!F38=\"\",\"\",'Plan Design Summary'!F38)","v":""}]
[null,{"$f":"IF('Plan Design Summary'!B39=\"\",\"\",'Plan Design Summary'!B39)","v":""},{"$f":"IF('Plan Design Summary'!C39=\"\",\"\",'Plan Design Summary'!C39)","v":""},{"$f":"IF('Plan Design Summary'!D39=\"\",\"\",'Plan Design Summary'!D39)","v":""},{"$f":"IF('Plan Design Summary'!E39=\"\",\"\",'Plan Design Summary'!E39)","v":""},{"$f":"IF('Plan Design Summary'!F39=\"\",\"\",'Plan Design Summary'!F39)","v":""}]
[null,{"$f":"IF('Plan Design Summary'!B40=\"\",\"\",'Plan Design Summary'!B40)","v":""},{"$f":"IF('Plan Design Summary'!C40=\"\",\"\",'Plan Design Summary'!C40)","v":""},{"$f":"IF('Plan Design Summary'!D40=\"\",\"\",'Plan Design Summary'!D40)","v":""},{"$f":"IF('Plan Design Summary'!E40=\"\",\"\",'Plan Design Summary'!E40)","v":""},{"$f":"IF('Plan Design Summary'!F40=\"\",\"\",'Plan Design Summary'!F40)","v":""}]
{"$rows_left_out":216}